{"text_format":"1","workbook":"xlsx","n_sheets":12,"sheets":["Menü","Beschreibung","Berechnung Gleichg.preis","Ergebnistabelle Gleichg.preis","Reifezahlrechner","Infos zu Trocknung u. Schwund","Trocknungstabelle","Sorten","Beraterdaten","Entzüge und Nährstoffpreise","Standardwerte","Parameter Reifezahl"],"not_rendered":{"charts":0,"images":1,"macros":1,"external_links":0,"defined_names":10,"comments":1,"pivot_tables":0},"unopened":[],"bounds":{"document_bytes":16777216,"sheet_cells":100000,"rows_first":2000,"rows_last":500,"rows_between":2000,"halvings":0,"cell_chars":16384,"cell_head_chars":4096},"cells_cut":0,"cells_raw":0,"read":"whole","date_system":"1900"}

{"sheet":"Menü","index":0,"n_rows":15,"n_cols":4,"rows_kept":15,"cut":false,"hidden":false,"merged":[[14,0,14,3]]}
[null,{"$error":"#VALUE!"}]
[null,"Wirtschaftlichkeitsrechner Maisanbau"]
[null,"MENÜ (Auswahl per Doppelklick)"]
[]
[null,"Beraterdaten",null,"Infos zu Trocknung und Schwund"]
[]
[null,"Beschreibung/Nutzungshinweise",null,"Trocknungstabelle"]
[]
[null,"Berechnung Gleichgewichtspreis",null,"Sortentypen"]
[]
[null,"Ergebnistabelle Gleichg.preis",null,"Entzüge und Nährstoffpreise"]
[]
[null,"Reifezahlrechner",null,"Parameter Reifezahl"]
[]
["Ansprechpartner: Bernhard Blackert, Fachgebiet 11.1 \"Beratungsteam Ökonomie\"\nKontakt:                  0561/7299-330, Bernhard.Blackert@LLH.hessen.de"]
{"$rows_left_out":1}
{"sheet":"Beschreibung","index":1,"n_rows":27,"n_cols":2,"rows_kept":27,"cut":false,"hidden":false,"merged":[[26,0,26,1],[2,0,2,2],[4,1,4,2],[6,1,6,2],[12,1,12,2],[16,1,16,2],[24,1,24,2],[25,1,25,2]]}
[null,{"$error":"#VALUE!"}]
[null,"Wirtschaftlichkeitsrechner Maisanbau"]
["Mit dieser Excel-Anwendung können drei Fragestellungen bearbeitet werden:"]
[]
["1)"," Ist bei der angebauten Sorte bzw. dem Sortentyp eine Nutzung als Körnermais oder als \n Energie- bzw. Silomais wirtschaftlicher?"]
[]
["2) ","Welcher Preis ist für die Vermarktung als Feuchtmais erforderlich, um gegenüber der Vermarktung als trockenes Korn keinen ökonomischen Nachteil zu haben?"]
[]
["3)","Ist aufgrund hoher Trocknungskosten im Körnermaisanbau der Anbau von Sorten mit niedriger Reifezahl wirtschaftlicher als der Anbau ertragreicherer Sorten mit hoher Reifezahl?"]
[]
["zu Fragestellung 1:"]
[]
[null,"In Jahren mit hohen Maiserträgen stellt sich oft die Frage, ob die letzten Hektar noch in das Silo gezwängt oder lieber als Körnermais genutzt werden sollen. \nBei normalem Kulturzustand besteht eine relativ feste Beziehung zwischen Gesamttrocken-masseertrag und Trockenmasseertrag Korn. Durch Vorgabe des Sortentyps kann deshalb bei einem geschätzten Trockenmasseertrag des Bestandes  die Ertragserwartung Korn ermittelt werden. \nDie Anwendung errechnet unter Berücksichtigung der Kosten für Trocknung, Ernte, Abtransport des Erntegutes und mulchen der Stengel den Gleichgewichtspreis für Körnermais aus. Bei diesem Preis ist die Wirtschaftlichkeit von Körner- und Ganzpflanzennutzung gleich. In die Berechnung fließen auch die Kosten unterschiedlicher Nährstoffentzüge unter Berücksichtigung von Gärrestrückführung ein."]
[]
["zu Fragestellung 2:"]
{"$rows_left_out":13}
{"sheet":"Berechnung Gleichg.preis","index":2,"n_rows":37,"n_cols":10,"rows_kept":37,"cut":false,"hidden":false,"merged":[[0,1,0,3],[21,9,22,9],[18,9,19,9],[2,6,2,10],[6,0,6,4],[19,0,19,4],[2,0,2,4],[4,0,4,4],[3,0,3,4]]}
[null,{"$error":"#VALUE!"}]
[]
["Körner- oder Silonutzung?   Gleichgewichtspreis Körnermais?",null,null,null,null,null,"Ergebnisübersicht"]
[]
["Alle Preise und Kosten ohne Umsatz- und Vorsteuer angeben !"]
[]
["Eingaben zur Nutzung als Silomais/Biogasmais"]
[]
[null,"Sortentyp",null,"Körner spezial",null,null,null,"Ertrag Silonutzung dt FM/ha bei 32% TM",null,{"$f":"IF(G25=\"\",(D11/32*100*10),\"\")","v":406.25}]
[]
[null,"Ertragsschätzung Silonutzung in t TM/ha ",null,13,null,null,null,"Kornertrag feucht in dt/ha",null,{"$f":"IF(G25=\"\",(J13/(((D22-D24)*D26-1)*(-1))),\"\")","v":112.6086445853888}]
[]
[null,"Preis je t TM",null,80,null,null,null,"Kornertrag bei Regelfeuchte in dt/ha",null,{"$f":"IF(G25=\"\",(((D11*VLOOKUP(D9,Sorten!B3:C29,2,FALSE)/(1-D24)))*10),\"\")","v":89.186046511627922}]
[]
[null,"Höhe der Gärrestrücklieferung in % des Frischmasseertrages",null,0.75]
{"$rows_left_out":23}
{"sheet":"Ergebnistabelle Gleichg.preis","index":3,"n_rows":21,"n_cols":12,"rows_kept":21,"cut":false,"hidden":false,"merged":[[7,1,7,11],[10,4,10,6],[11,4,11,6],[0,1,0,5],[10,9,10,10],[11,9,11,10],[2,1,2,11],[4,1,4,11],[5,1,5,11]]}
[null,{"$error":"#VALUE!"}]
[]
[null,"Gleichgewichtspreis für Körnermais bei gegebenem Ertrag und Preis für Silomais"]
[]
[null,"Gleichgewichtspreis für Feuchtmais bei gegebenem Preis für Körnermais (trockene Ware)"]
[null,"Bereinigter Erlösvor- bzw. - nachteil je ha bei gegebenem Marktpreis für Körnermais"]
[]
[null,{"$f":"CONCATENATE(\"Ergebnistabelle für eine Sorte des Typs \",\"'\",'Berechnung Gleichg.preis'!D9,\"'\")","v":"Ergebnistabelle für eine Sorte des Typs 'Körner spezial'"}]
[]
[]
[null,"Ertrag Silomais TM in t/ha",{"$f":"'Berechnung Gleichg.preis'!$D$11","v":13},null,"Kornertrag feucht in dt",null,null,{"$f":"'Berechnung Gleichg.preis'!$J$11","v":112.6086445853888},null,"Preis Silomais je t TM",null,{"$f":"'Berechnung Gleichg.preis'!$D$13","v":80}]
[null,"Ertrag Silomais 32 % TM dt/ha",{"$f":"'Berechnung Gleichg.preis'!$J$9","v":406.25},null,"Kornertrag trocken in dt",null,null,{"$f":"'Berechnung Gleichg.preis'!$J$13","v":89.186046511627922},null,"Preis Körnermais je dt",null,{"$f":"'Berechnung Gleichg.preis'!$D$34","v":21}]
[]
[null,"Kornfeuchte in %",{"$f":"'Berechnung Gleichg.preis'!D22","v":0.30000000000000004},{"$f":"Trocknungstabelle!B46","v":0.25},{"$f":"Trocknungstabelle!B56","v":0.26},{"$f":"Trocknungstabelle!B66","v":0.27},0.28000000000000003,0.28999999999999998,{"$f":"'Berechnung Gleichg.preis'!D22","v":0.30000000000000004},{"$f":"Trocknungstabelle!B106","v":0.31000000000000005},{"$f":"Trocknungstabelle!B116","v":0.32000000000000006},{"$f":"Trocknungstabelle!B126","v":0.33000000000000007}]
[null,"Gleichgewichtpreis für Körnermais\nje dt",{"$f":"IF('Berechnung Gleichg.preis'!$J$16=\"\",\"\",((('Berechnung Gleichg.preis'!$D$11*'Berechnung Gleichg.preis'!$D$13)+(('Berechnung Gleichg.preis'!$D$11*VLOOKUP('Berechnung Gleichg.preis'!$D$9,Sorten!$B$3:$C$29,2,FALSE)/(1-'Berechnung Gleichg.preis'!$D$24))/(((C14-'Berechnung Gleichg.preis'!$D$24)*'Berechnung Gleichg.preis'!$D$26-1)*(-1)))*(VLOOKUP(C14,Trocknungstabelle!$B$6:$C$165,2)*10)+'Berechnung Gleichg.preis'!$D$28+'Berechnung Gleichg.preis'!$D$30+'Berechnung Gleichg.preis'!$D$32-'Entzüge und Nährstoffpreise'!$D$11))/('Berechnung Gleichg.preis'!$D$11*VLOOKUP('Berechnung Gleichg.preis'!$D$9,Sorten!$B$3:$C$29,2,FALSE)/(1-'Berechnung Gleichg.preis'!$D$24))/10)","v":20.662736039255002},{"$f":"IF('Berechnung Gleichg.preis'!$J$16=\"\",\"\",((('Berechnung Gleichg.preis'!$D$11*'Berechnung Gleichg.preis'!$D$13)+(('Berechnung Gleichg.preis'!$D$11*VLOOKUP('Berechnung Gleichg.preis'!$D$9,Sorten!$B$3:$C$29,2,FALSE)/(1-'Berechnung Gleichg.preis'!$D$24))/(((D14-'Berechnung Gleichg.preis'!$D$24)*'Berechnung Gleichg.preis'!$D$26-1)*(-1)))*(VLOOKUP(D14,Trocknungstabelle!$B$6:$C$165,2)*10)+'Berechnung Gleichg.preis'!$D$28+'Berechnung Gleichg.preis'!$D$30+'Berechnung Gleichg.preis'!$D$32-'Entzüge und Nährstoffpreise'!$D$11))/('Berechnung Gleichg.preis'!$D$11*VLOOKUP('Berechnung Gleichg.preis'!$D$9,Sorten!$B$3:$C$29,2,FALSE)/(1-'Berechnung Gleichg.preis'!$D$24))/10)","v":19.347954619456075},{"$f":"IF('Berechnung Gleichg.preis'!$J$16=\"\",\"\",((('Berechnung Gleichg.preis'!$D$11*'Berechnung Gleichg.preis'!$D$13)+(('Berechnung Gleichg.preis'!$D$11*VLOOKUP('Berechnung Gleichg.preis'!$D$9,Sorten!$B$3:$C$29,2,FALSE)/(1-'Berechnung Gleichg.preis'!$D$24))/(((E14-'Berechnung Gleichg.preis'!$D$24)*'Berechnung Gleichg.preis'!$D$26-1)*(-1)))*(VLOOKUP(E14,Trocknungstabelle!$B$6:$C$165,2)*10)+'Berechnung Gleichg.preis'!$D$28+'Berechnung Gleichg.preis'!$D$30+'Berechnung Gleichg.preis'!$D$32-'Entzüge und Nährstoffpreise'!$D$11))/('Berechnung Gleichg.preis'!$D$11*VLOOKUP('Berechnung Gleichg.preis'!$D$9,Sorten!$B$3:$C$29,2,FALSE)/(1-'Berechnung Gleichg.preis'!$D$24))/10)","v":19.594709805351989},{"$f":"IF('Berechnung Gleichg.preis'!$J$16=\"\",\"\",((('Berechnung Gleichg.preis'!$D$11*'Berechnung Gleichg.preis'!$D$13)+(('Berechnung Gleichg.preis'!$D$11*VLOOKUP('Berechnung Gleichg.preis'!$D$9,Sorten!$B$3:$C$29,2,FALSE)/(1-'Berechnung Gleichg.preis'!$D$24))/(((F14-'Berechnung Gleichg.preis'!$D$24)*'Berechnung Gleichg.preis'!$D$26-1)*(-1)))*(VLOOKUP(F14,Trocknungstabelle!$B$6:$C$165,2)*10)+'Berechnung Gleichg.preis'!$D$28+'Berechnung Gleichg.preis'!$D$30+'Berechnung Gleichg.preis'!$D$32-'Entzüge und Nährstoffpreise'!$D$11))/('Berechnung Gleichg.preis'!$D$11*VLOOKUP('Berechnung Gleichg.preis'!$D$9,Sorten!$B$3:$C$29,2,FALSE)/(1-'Berechnung Gleichg.preis'!$D$24))/10)","v":19.849185370108664},{"$f":"IF('Berechnung Gleichg.preis'!$J$16=\"\",\"\",((('Berechnung Gleichg.preis'!$D$11*'Berechnung Gleichg.preis'!$D$13)+(('Berechnung Gleichg.preis'!$D$11*VLOOKUP('Berechnung Gleichg.preis'!$D$9,Sorten!$B$3:$C$29,2,FALSE)/(1-'Berechnung Gleichg.preis'!$D$24))/(((G14-'Berechnung Gleichg.preis'!$D$24)*'Berechnung Gleichg.preis'!$D$26-1)*(-1)))*(VLOOKUP(G14,Trocknungstabelle!$B$6:$C$165,2)*10)+'Berechnung Gleichg.preis'!$D$28+'Berechnung Gleichg.preis'!$D$30+'Berechnung Gleichg.preis'!$D$32-'Entzüge und Nährstoffpreise'!$D$11))/('Berechnung Gleichg.preis'!$D$11*VLOOKUP('Berechnung Gleichg.preis'!$D$9,Sorten!$B$3:$C$29,2,FALSE)/(1-'Berechnung Gleichg.preis'!$D$24))/10)","v":20.111749400248804},{"$f":"IF('Berechnung Gleichg.preis'!$J$16=\"\",\"\",((('Berechnung Gleichg.preis'!$D$11*'Berechnung Gleichg.preis'!$D$13)+(('Berechnung Gleichg.preis'!$D$11*VLOOKUP('Berechnung Gleichg.preis'!$D$9,Sorten!$B$3:$C$29,2,FALSE)/(1-'Berechnung Gleichg.preis'!$D$24))/(((H14-'Berechnung Gleichg.preis'!$D$24)*'Berechnung Gleichg.preis'!$D$26-1)*(-1)))*(VLOOKUP(H14,Trocknungstabelle!$B$6:$C$165,2)*10)+'Berechnung Gleichg.preis'!$D$28+'Berechnung Gleichg.preis'!$D$30+'Berechnung Gleichg.preis'!$D$32-'Entzüge und Nährstoffpreise'!$D$11))/('Berechnung Gleichg.preis'!$D$11*VLOOKUP('Berechnung Gleichg.preis'!$D$9,Sorten!$B$3:$C$29,2,FALSE)/(1-'Berechnung Gleichg.preis'!$D$24))/10)","v":20.208880715834461},{"$f":"IF('Berechnung Gleichg.preis'!$J$16=\"\",\"\",((('Berechnung Gleichg.preis'!$D$11*'Berechnung Gleichg.preis'!$D$13)+(('Berechnung Gleichg.preis'!$D$11*VLOOKUP('Berechnung Gleichg.preis'!$D$9,Sorten!$B$3:$C$29,2,FALSE)/(1-'Berechnung Gleichg.preis'!$D$24))/(((I14-'Berechnung Gleichg.preis'!$D$24)*'Berechnung Gleichg.preis'!$D$26-1)*(-1)))*(VLOOKUP(I14,Trocknungstabelle!$B$6:$C$165,2)*10)+'Berechnung Gleichg.preis'!$D$28+'Berechnung Gleichg.preis'!$D$30+'Berechnung Gleichg.preis'!$D$32-'Entzüge und Nährstoffpreise'!$D$11))/('Berechnung Gleichg.preis'!$D$11*VLOOKUP('Berechnung Gleichg.preis'!$D$9,Sorten!$B$3:$C$29,2,FALSE)/(1-'Berechnung Gleichg.preis'!$D$24))/10)","v":20.662736039255002},{"$f":"IF('Berechnung Gleichg.preis'!$J$16=\"\",\"\",((('Berechnung Gleichg.preis'!$D$11*'Berechnung Gleichg.preis'!$D$13)+(('Berechnung Gleichg.preis'!$D$11*VLOOKUP('Berechnung Gleichg.preis'!$D$9,Sorten!$B$3:$C$29,2,FALSE)/(1-'Berechnung Gleichg.preis'!$D$24))/(((J14-'Berechnung Gleichg.preis'!$D$24)*'Berechnung Gleichg.preis'!$D$26-1)*(-1)))*(VLOOKUP(J14,Trocknungstabelle!$B$6:$C$165,2)*10)+'Berechnung Gleichg.preis'!$D$28+'Berechnung Gleichg.preis'!$D$30+'Berechnung Gleichg.preis'!$D$32-'Entzüge und Nährstoffpreise'!$D$11))/('Berechnung Gleichg.preis'!$D$11*VLOOKUP('Berechnung Gleichg.preis'!$D$9,Sorten!$B$3:$C$29,2,FALSE)/(1-'Berechnung Gleichg.preis'!$D$24))/10)","v":20.964858677706264},{"$f":"IF('Berechnung Gleichg.preis'!$J$16=\"\",\"\",((('Berechnung Gleichg.preis'!$D$11*'Berechnung Gleichg.preis'!$D$13)+(('Berechnung Gleichg.preis'!$D$11*VLOOKUP('Berechnung Gleichg.preis'!$D$9,Sorten!$B$3:$C$29,2,FALSE)/(1-'Berechnung Gleichg.preis'!$D$24))/(((K14-'Berechnung Gleichg.preis'!$D$24)*'Berechnung Gleichg.preis'!$D$26-1)*(-1)))*(VLOOKUP(K14,Trocknungstabelle!$B$6:$C$165,2)*10)+'Berechnung Gleichg.preis'!$D$28+'Berechnung Gleichg.preis'!$D$30+'Berechnung Gleichg.preis'!$D$32-'Entzüge und Nährstoffpreise'!$D$11))/('Berechnung Gleichg.preis'!$D$11*VLOOKUP('Berechnung Gleichg.preis'!$D$9,Sorten!$B$3:$C$29,2,FALSE)/(1-'Berechnung Gleichg.preis'!$D$24))/10)","v":21.277236131561882},{"$f":"IF('Berechnung Gleichg.preis'!$J$16=\"\",\"\",((('Berechnung Gleichg.preis'!$D$11*'Berechnung Gleichg.preis'!$D$13)+(('Berechnung Gleichg.preis'!$D$11*VLOOKUP('Berechnung Gleichg.preis'!$D$9,Sorten!$B$3:$C$29,2,FALSE)/(1-'Berechnung Gleichg.preis'!$D$24))/(((L14-'Berechnung Gleichg.preis'!$D$24)*'Berechnung Gleichg.preis'!$D$26-1)*(-1)))*(VLOOKUP(L14,Trocknungstabelle!$B$6:$C$165,2)*10)+'Berechnung Gleichg.preis'!$D$28+'Berechnung Gleichg.preis'!$D$30+'Berechnung Gleichg.preis'!$D$32-'Entzüge und Nährstoffpreise'!$D$11))/('Berechnung Gleichg.preis'!$D$11*VLOOKUP('Berechnung Gleichg.preis'!$D$9,Sorten!$B$3:$C$29,2,FALSE)/(1-'Berechnung Gleichg.preis'!$D$24))/10)","v":21.600399526719286}]
{"$rows_left_out":7}
{"sheet":"Reifezahlrechner","index":4,"n_rows":53,"n_cols":14,"rows_kept":53,"cut":false,"hidden":false,"merged":[[2,1,2,13],[19,13,20,13],[10,4,10,5],[12,4,12,5],[19,6,20,6],[19,7,20,7],[19,8,20,8],[19,9,20,9],[19,10,20,10],[19,11,20,11],[19,12,20,12],[14,0,15,0],[19,2,20,2],[19,3,20,3],[19,4,20,4],[19,5,20,5]]}
[null,{"$error":"#VALUE!"}]
[null,"Wirtschaftlichkeitsrechner Maisanbau"]
[null,"Notwendiger Mehrertrag für Körnermaissorten mit hoher Reifezahl gegenüber Sorten mit niedriger Reifezahl"]
[]
[]
[]
[]
[]
[]
[]
[null,"Reifezahl Sorte 1",250,null,"Erntefeuchte in %",null,0.33600000000000008,null,{"$f":"\"Trocknungskosten bei \"&C16&\" dt Ertrag\"","v":"Trocknungskosten bei 100 dt Ertrag"},null,null,null,{"$f":"IF(G11=\"\",\"\",$C$16/((100-(G11*100-14)*1.3)/100)*VLOOKUP(G11,Trocknungstabelle!B6:C196,2))","v":758.18572195383797}]
[]
[null,"Reifezahl Sorte 2",190,null,"Erntefeuchte in %",null,{"$f":"IF(I44<27,27,I44)/100","v":0.27600000000000008},null,{"$f":"\"Trocknungskosten bei \"&C16&\" dt Ertrag\"","v":"Trocknungskosten bei 100 dt Ertrag"},null,null,null,{"$f":"$C$16/((100-(G13*100-14)*1.3)/100)*VLOOKUP(G13,Trocknungstabelle!B6:C196,2)","v":580.66083576287667}]
[]
[]
{"$rows_left_out":39}
{"sheet":"Infos zu Trocknung u. Schwund","index":5,"n_rows":11,"n_cols":2,"rows_kept":11,"cut":false,"hidden":false,"merged":[[2,0,2,1],[10,0,10,1],[4,1,4,2],[6,1,6,2],[8,1,8,2]]}
[null,{"$error":"#VALUE!"}]
[null,"Wirtschaftlichkeitsrechner Maisanbau"]
["Informationen zur Trocknung und zum Schwundfaktor"]
[]
[null,"Die Regelfeuchte für Körnermais beträgt 14 %. Die Ernte erfolgt mit Kornfeuchten zwischen\n25 und 40 %. Beim Trocknungsvorgang bedeutet jedes abgegebene Prozent Wasser einen\nGewichtsverlust von 1,176 kg/dt. woraus sich, aufgerundet, ein theoretischer Schwundfaktor\nvon 1,2 errechnet.\nDurch Abrieb, Staub, Besatz und Bruchkorn liegen die Verhältnisse in der Praxis komplexer und\nmit zunehmender Erntefeuchte entsteht bei Trocknung ein höherer Gewichtsverlust als der\ntheoretisch errechnete.\nIn Deutschland wird meist mit einem konstanten Schwundfaktor von 1,3 oder 1,35 gerechnet."]
[]
[null,"Bei Anwendung des Schwundfaktors wird wie folgt gerechnet:\n\n(((Ausgangsfeuchte - Endfeuchte) x Schwundfaktor - 100) x (-1)/100) x Gewicht feucht\n\nAls Ergebnis erhält man die Menge trockene Ware.\n\nRechenbeispiel:\nKornfeuchte bei Ernte 32 %;   Regelfeuchte 14 %; \nSchwundfaktor des Handels 1,3;   Erntemenge feucht 150 dt\n \n(32 - 14) x 1,3 = 23,4 -100 = - 76,6 x -1 = 76,6 / 100 = 0,766\n\n150 dt x 0,766 = 114,9 dt trockene Ware bei 14 % Kornfeuchte"]
[]
[null,"Trocknungskosten\nDie Trocknungskosten errechnen sich aus dem Produkt von erntefeuchter Ware und der\nKosten je dt gemäß der gültigen Trocknungstabelle."]
[]
["Ansprechpartner: Bernhard Blackert, Fachgebiet 11.1 \"Beratungsteam Ökonomie\"\nKontakt:                  0561/7299-330, Bernhard.Blackert@LLH.hessen.de"]

{"sheet":"Trocknungstabelle","index":6,"n_rows":196,"n_cols":3,"rows_kept":196,"cut":false,"hidden":false,"merged":[]}
[]
[null,"Trocknungstabelle gültig für Ernte 2024"]
[]
[]
[null,"Feuchte","Preis je 100 kg"]
[null,0.21,3.94]
[null,{"$f":"B6+0.1%","v":0.21099999999999999},3.94]
[null,{"$f":"B7+0.1%","v":0.21199999999999999},3.94]
[null,0.21299999999999999,3.94]
[null,{"$f":"B9+0.1%","v":0.214},3.94]
[null,0.215,3.94]
[null,0.216,3.94]
[null,0.217,3.94]
[null,0.218,3.94]
[null,0.219,3.94]
{"$rows_left_out":182}
{"sheet":"Sorten","index":7,"n_rows":29,"n_cols":6,"rows_kept":29,"cut":false,"hidden":false,"merged":[[1,2,1,3]]}
[null,"Kornanteil der Einzelsorten laut Angaben des Züchters"]
[null,"Sortentyp","Kornanteil an der TM in %"]
[null,"ausgeglichen",{"$f":"52%*F11","v":0.52},"50 - 55%"]
[null,"Energiemais",{"$f":"45%*F11","v":0.45},"40 - 50%"]
[null,"kolbenbetont",{"$f":"55%*F11","v":0.55000000000000004},"55 - 60%"]
[null,"Körner spezial",{"$f":"59%*F11","v":0.59}]
[null,"COLISEE",{"$f":"52.8%*F11","v":0.52800000000000002},"früh"]
[null,"FABREGAS",{"$f":"49.2%*F11","v":0.49200000000000005}]
[null,"KOMPETENS",{"$f":"51.1%*F11","v":0.51100000000000001},null,"Abweichung vom Durchschnitt, Einschätzung Jahreseffekt"]
[null,"KWS STABIL",{"$f":"52%*F11","v":0.52}]
[null,"BARROS",{"$f":"49.2%*F11","v":0.49200000000000005},"mittelfrüh","Faktor",1]
[null,"CAROLINIO KWS",{"$f":"50.3%*F11","v":0.503}]
[null,"CORFINIO KWS",{"$f":"44.9%*F11","v":0.44900000000000001}]
[null,"FERNANDEZ",{"$f":"49.6%*F11","v":0.496}]
[null,"FREDERICO KWS",{"$f":"50.5%*F11","v":0.505}]
{"$rows_left_out":15}
{"sheet":"Beraterdaten","index":8,"n_rows":8,"n_cols":3,"rows_kept":8,"cut":false,"hidden":false,"merged":[]}
[]
[null,"Kontaktdaten der Beraterin/des Beraters"]
[]
[null,"Vorname","Bernhard"]
[null,"Name","Blackert"]
[null,"Fachgebiet","FG 11.1 \"Beratungsteam Ökonomie\""]
[null,"LLH-Standort","Zentrale Kassel"]
[null,"Telefonnummer","0561/7299-330"]

{"sheet":"Entzüge und Nährstoffpreise","index":9,"n_rows":13,"n_cols":7,"rows_kept":13,"cut":false,"hidden":false,"merged":[[10,4,10,6]]}
[]
[null,"Entzüge je dt","N","P2O5","K2O","MgO","Nährstoff-wert"]
[null,"Energiemais bei \n100 % TM",1.33,0.55000000000000004,1.5,0.36,{"$f":"C3*C7+D3*D7+E3*E7+F3*F7","v":4.2488999999999999}]
[null,"Körnermais bei \n100 % TM",{"$f":"1.51/0.86","v":1.7558139534883721},{"$f":"0.8/0.86","v":0.93023255813953498},{"$f":"0.5/0.86","v":0.58139534883720934},{"$f":"0.25/0.86","v":0.29069767441860467},{"$f":"C4*C7+D4*D7+E4*E7+F4*F7","v":4.621511627906977}]
[null,"Nährstoffrückführung je t bzw m3"]
[null,"Substrat",3.34,1.77,3.77,0.5,{"$f":"C6*C7+D6*D7+E6*E7+F6*F7","v":10.7562}]
[null,"Nährstoffpreis",1.45,1.4,0.76,1.1399999999999999]
[]
[]
[]
[null,null,14.5,{"$f":"((G3)*'Berechnung Gleichg.preis'!D11*10)-('Berechnung Gleichg.preis'!D11/C12*100)*(G6*'Berechnung Gleichg.preis'!D15)+(('Berechnung Gleichg.preis'!D11/C12*100*C13))*'Berechnung Gleichg.preis'!D15-('Berechnung Gleichg.preis'!D11*VLOOKUP('Berechnung Gleichg.preis'!D9,Sorten!B3:C29,2,FALSE))*G4*10","v":37.73721438953487},"Vorteil Düngekosten für Körnermais"]
[null,"TM-Gehalt Biogasmais",32]
[null,"Gülleausbringung",{"$f":"'Berechnung Gleichg.preis'!D17","v":5.5}]

{"sheet":"Standardwerte","index":10,"n_rows":27,"n_cols":3,"rows_kept":27,"cut":false,"hidden":false,"merged":[]}
[]
[null,"Sortentyp","ausgeglichen"]
[]
[null,"Ertragsschätzung Silonutzung in t TM/ha ",20]
[]
[null,"Preis je t TM",71]
[]
[null,"Höhe der Gärrestrücklieferung in % des Frischmasseertrages",0.75]
[]
[null,"Ausbringkosten Gärrest in €/m3",3]
[]
[]
[]
[]
[null,"Kornfeuchte Erntegut in%",0.31000000000000005]
{"$rows_left_out":13}
{"sheet":"Parameter Reifezahl","index":11,"n_rows":5,"n_cols":7,"rows_kept":5,"cut":false,"hidden":false,"merged":[]}
[]
[null,null,"N","P2O5","K2O","MgO","Nährstoffwert"]
[null,"Entzüge je dt Ertrag bei 86 % TM",1.51,0.8,0.5,0.25,{"$f":"C3*C5+D3*D5+E3*E5+F3*F5","v":2.9860000000000002}]
[]
[null,"Nährstoffpreis je kg Reinnährstoff",1.1000000000000001,1,0.7,0.7]